Du bist nicht angemeldet.

#1 06.07.2006 23:11:27

MacWolf
Mitglied

mal wieder der "kernel"

http://www.swprozee1.com/wolf/nopaste...

so...damit das nicht so lang wird....
komm ich heute mal wieder...ausm urlaub...erstmal nen X server fehler ^^....update....immerhin nochmal 248MB...so...neuer kernel raus...okay...update per pacman hat gefunzt...so...dann wollt ich den selber bauen...und folgendes (oben im link) passierte

irgendeiner ne erklärung?

^^ fängt ja shcon gut an das..."reaktivieren"

Beitrag geändert von Pierre (01.12.2007 12:31:24)

Offline

#2 06.07.2006 23:39:36

Pierre
Entwickler

Re: mal wieder der "kernel"

sieht nach Bugs im Quellcode aus. Brauchst Du dieses pwc denn?

Offline

#3 07.07.2006 00:18:35

MacWolf
Mitglied

Re: mal wieder der "kernel"

pwc...öhm ^^
[niclas@Arch ~]$ pacman -Qs pwc
[niclas@Arch ~]$ pacman -Ss pwc
extra/pwc 10.0.11-5
Video4Linux Driver for Philips and Logitech Webcams

hab ich das drauf o.O
also ich seh nix ^^

Offline

#4 07.07.2006 00:29:47

MacWolf
Mitglied

Re: mal wieder der "kernel"

/usr/include/bits/socket.h:304:24: error: asm/socket.h: No such file or directory

liegt da nich eher das problem?

Offline

#5 07.07.2006 00:57:02

Pierre
Entwickler

Re: mal wieder der "kernel"

Ah, habe irgendwie was durcheinander gebracht. Warum baust Du Dir den Kernel nicht mit abs?

Offline

#6 07.07.2006 01:17:27

MacWolf
Mitglied

Re: mal wieder der "kernel"

will ich doch ^^
und dann kommt halt der fehler...

(sofern du mit abs = /var/abs/kernels/kernel26 -kopieren-> /var/abs/niclas/kernel26 -> makepkg)

/edit

rhythmbox

checking how to run the C preprocessor... /lib/cpp
configure: error: C preprocessor "/lib/cpp" fails sanity check
See `config.log' for more details.
make: *** No targets specified and no makefile found.  Stop.
==> ERROR: Build Failed.  Aborting...

xvidcore

checking how to run the C preprocessor... /lib/cpp
configure: error: C preprocessor "/lib/cpp" fails sanity check
See `config.log' for more details.
  D: =build
make: /usr/bin/install: Command not found
make: *** [=build] Error 127
==> ERROR: Build Failed.  Aborting...

xine-lib

checking how to run the C preprocessor... /lib/cpp
configure: error: C preprocessor "/lib/cpp" fails sanity check
See `config.log' for more details.
make: *** No targets specified and no makefile found.  Stop.

könnte da was an meinem gcc/system sein?
hab mal auf die letzte funktionierende version die ich hatte down-gegradet (ich liebe denglisch -.-)...kam das gleiche (zw. aucm mal restart gemacht...)

Beitrag geändert von MacWolf (07.07.2006 01:40:43)

Offline

#7 07.07.2006 11:56:33

Pierre
Entwickler

Re: mal wieder der "kernel"

Was steht denn im besagtem config.log? Hast Du irgendwas an /etc/makepkg.conf geändert?

Offline

#8 07.07.2006 13:06:16

MacWolf
Mitglied

Re: mal wieder der "kernel"

mh....das problem ist <solved> ^^
lag entweder an den kernel-headers oder am kernel wink
hab mir mal die kernel-headers kompiliert...ein neuer kernel war draußen ... neu gestartet...und es hat funktioniert ^^

ich guck gleich mal ob das jetzt mitm kernel auch funzt

/edit
kernel kompilieren scheint auch wieder zu funktionieren o.O
das soll mal einer verstehen ^^

Beitrag geändert von MacWolf (07.07.2006 13:09:34)

Offline

#9 07.07.2006 15:00:12

tpowa
Gast

Re: mal wieder der "kernel"

pwc ist im neuen kernel mit drin und sollte einwandfrei gehen

Schnellantwort auf dieses Thema

Schreibe deinen Beitrag und versende ihn
Deine Antwort

Fußzeile des Forums